[Gc] gc6.3alpha6: "make check" fails on NetBSD/sparc-1.5

Boehm, Hans hans.boehm at hp.com
Mon May 10 15:16:13 PDT 2004


Thanks.  Can you try the attached patch?

The offending code was a workaround for an ancient Solaris version,
which shouldn't be used for NetBSD.

(I assume "sun" is not normally defined on NetBSD.)

Hans

> -----Original Message-----
> From: gc-bounces at napali.hpl.hp.com
> [mailto:gc-bounces at napali.hpl.hp.com]On Behalf Of Adrian Bunk
> Sent: Sunday, May 09, 2004 11:43 PM
> To: gc at napali.hpl.hp.com
> Subject: [Gc] gc6.3alpha6: "make check" fails on NetBSD/sparc-1.5
> 
> 
> I'm getting in all versions of gc up to gc6.3alpha6 the 
> following error 
> during "make check" on a NetBSD/sparc-1.5 machine:
> 
> <--  snip  -->
> 
> Making check in doc
> gmake[1]: Entering directory `/aux/adrian/build/gc6.3alpha6/doc'
> gmake[1]: Nothing to be done for `check'.
> gmake[1]: Leaving directory `/aux/adrian/build/gc6.3alpha6/doc'
> Making check in include
> gmake[1]: Entering directory `/aux/adrian/build/gc6.3alpha6/include'
> gmake[1]: Nothing to be done for `check'.
> gmake[1]: Leaving directory `/aux/adrian/build/gc6.3alpha6/include'
> gmake[1]: Entering directory `/aux/adrian/build/gc6.3alpha6'
> gmake  gctest
> gmake[2]: Entering directory `/aux/adrian/build/gc6.3alpha6'
> gcc -DPACKAGE_NAME=\"gc\" -DPACKAGE_TARNAME=\"gc\" 
> -DPACKAGE_VERSION=\"6.3alpha6\" -DPACKAGE_STRING=\"gc\ 
> 6.3alpha6\" -DPACKAGE_BUGREPORT=\"Hans.Boehm at hp.com\" 
> -DGC_VERSION_MAJOR=6 -DGC_VERSION_MINOR=3 
> -DGC_ALPHA_VERSION=6 -DPACKAGE=\"gc\" -DVERSION=\"6.3alpha6\" 
> -DSTDC_HEADERS=1 -DHAVE_SYS_TYPES_H=1 -DHAVE_SYS_STAT_H=1 
> -DHAVE_STDLIB_H=1 -DHAVE_STRING_H=1 -DHAVE_MEMORY_H=1 
> -DHAVE_STRINGS_H=1 -DHAVE_INTTYPES_H=1 -DHAVE_UNISTD_H=1 
> -DHAVE_DLFCN_H=1 -DSILENT=1 -DNO_SIGNALS=1 
> -DNO_EXECUTE_PERMISSION=1 -DALL_INTERIOR_POINTERS=1 
> -DJAVA_FINALIZATION=1 -DGC_GCJ_SUPPORT=1 
> -DATOMIC_UNCOLLECTABLE=1  -I. -I. -I./include   -fexceptions 
> -O2 -mcpu=v8 -c ./tests/test.c
> ./tests/test.c: In function `main':
> ./tests/test.c:1501: conflicting types for `end'
> include/private/gcconfig.h:1899: previous declaration of `end'
> gmake[2]: *** [test.o] Error 1
> gmake[2]: Leaving directory `/aux/adrian/build/gc6.3alpha6'
> gmake[1]: *** [check-am] Error 2
> gmake[1]: Leaving directory `/aux/adrian/build/gc6.3alpha6'
> gmake: *** [check-recursive] Error 1
> 
> <--  snip  -->
> 
> cu
> Adrian
> 
> -- 
> 
>        "Is there not promise of rain?" Ling Tan asked suddenly out
>         of the darkness. There had been need of rain for many days.
>        "Only a promise," Lao Er said.
>                                        Pearl S. Buck - Dragon Seed
> 
> _______________________________________________
> Gc mailing list
> Gc at linux.hpl.hp.com
> http://www.hpl.hp.com/hosted/linux/mail-archives/gc/
> 

-------------- next part --------------
A non-text attachment was scrubbed...
Name: gc.h.diff
Type: application/octet-stream
Size: 443 bytes
Desc: not available
Url : http://napali.hpl.hp.com/pipermail/gc/attachments/20040510/f4e6f2ea/gc.h.obj


More information about the Gc mailing list