[httperf] error when issuing make command from cygwin

Bhagwan Anjanappa banjanap at mix.wvu.edu
Fri Jul 14 11:24:55 PDT 2006


Hi martin,
     I whenever I try to issue the make command from the build 
directory in cygwin I get the following error I have already configured 
httperf from the build directory the error I get is as follows it is 
ONLY A PART OF THE ERROR DISPLAYED AS IT IS A VERY LONG LIST IF THE 
COMPLETE LIST IS NEEDED THEN I WOULD SEND IT:

"/cygdrive/d/Abhi/http/test/httperf-0.8/stat/basic.c:84: warning: data 
definition has no type or storage class
/cygdrive/d/Abhi/http/test/httperf-0.8/stat/basic.c:85: error: parse 
error before "footer_bytes_received"
/cygdrive/d/Abhi/http/test/httperf-0.8/stat/basic.c:85: warning: type 
defaults to `int' in declaration of `footer_bytes_received'
/cygdrive/d/Abhi/http/test/httperf-0.8/stat/basic.c:85: warning: data 
definition has no type or storage class
/cygdrive/d/Abhi/http/test/httperf-0.8/stat/basic.c:88: error: parse 
error before '}' token
/cygdrive/d/Abhi/http/test/httperf-0.8/stat/basic.c:89: warning: type 
defaults to `int' in declaration of `basic'
/cygdrive/d/Abhi/http/test/httperf-0.8/stat/basic.c:89: warning: data 
definition has no type or storage class
/cygdrive/d/Abhi/http/test/httperf-0.8/stat/basic.c: In function 
`perf_sample':
/cygdrive/d/Abhi/http/test/httperf-0.8/stat/basic.c:107: error: request 
for member `reply_rate_sum' in something not a structure or union
/cygdrive/d/Abhi/http/test/httperf-0.8/stat/basic.c:108: error: request 
for member `reply_rate_sum2' in something not a structure or union"

and at the end of the error I get this

make[1]: *** [basic.o] Error 1
make[1]: Leaving directory `/cygdrive/c/cygwin/home/Abhi/build/stat'
make: *** [all-recursive] Error 1

I am lost I do not see basic.c in my stat folder in build HOWEVER I SEE 
IT IN THE stat folder of httperf which is installed in a saperate 
directory on my system. Any reply would be kindly appreciated.


More information about the httperf mailing list