[httperf] httperf-0.9.0 build problems on AIX 5.3

John Smith lbalbalba at gmail.com
Thu Apr 3 00:22:08 PST 2008


Hi,


I am experiencing some difficulties with compiling httperf-0.9.0 on my
AIX 5.3 box using gcc. I get the following error :

gcc -I../../src -I../../src/gen -I../../src/lib -I../../src/stat -Wall
-Wshadow -Wpointer-arith -Wcast-qual -W -gxcoff -DHAVE_SSL -o httperf
httperf.o object.o call.o conn.o sess.o core.o event.o http.o timer.o
gen/libgen.a lib/libutil.a stat/libstat.a -lnsl -lssl -lcrypto -lm
ld: 0711-317 ERROR: Undefined symbol: .rpl_malloc
ld: 0711-345 Use the -bloadmap or -bnoquiet option to obtain more information.
collect2: ld returned 8 exit status
make[3]: *** [httperf] Error 1
make[3]: Leaving directory
`/mount/data02411/klm01434/src/httperf/httperf-0.9.0/build/src'
make[2]: *** [all-recursive] Error 1
make[2]: Leaving directory
`/mount/data02411/klm01434/src/httperf/httperf-0.9.0/build/src'
make[1]: *** [all-recursive] Error 1
make[1]: Leaving directory
`/mount/data02411/klm01434/src/httperf/httperf-0.9.0/build'
make: *** [all] Error 2


Does anyone know what might be going on here, or how to go about fixing things ?


Thanks in advance,


John Smith.


More information about the httperf mailing list